View Issue Details

IDProjectCategoryView StatusLast Update
0000345FreeCADBugpublic2011-04-29 20:05
ReporterunauthenticatedAssigned To 
PrioritynormalSeveritycrashReproducibilityalways
Status closedResolutionfixed 
Product Version0.11 
Target VersionFixed in Version0.12 
Summary0000345: freecad won't compile with gcc 4.6: undefined reference to `Gui::
DescriptionAfter including in directory.h
#include <cstddef>

Gcc 4.6 is able to continue compilation at this point, but now I got another error:


t_regex -lboost_filesystem -lboost_system -lz -lpython2.7 -lxerces-c -Wl,-rpath -Wl,/usr/lib/freecad/lib
/home/dani/AUR/freecad/src/FreeCAD-0.11.4422/src/Gui/.libs/libFreeCADGui.so: undefined reference to `Gui::qInitResources_translation()'
/home/dani/AUR/freecad/src/FreeCAD-0.11.4422/src/Gui/.libs/libFreeCADGui.so: undefined reference to `Gui::qInitResources_resource()'
/home/dani/AUR/freecad/src/FreeCAD-0.11.4422/src/Gui/.libs/libFreeCADGui.so: undefined reference to `Gui::qt_x11_wait_for_window_manager(QWidget*)'
collect2: ld returned 1 exit status
make[3]: *** [FreeCAD] Error 1
make[3]: se sale del directorio `/home/dani/AUR/freecad/src/FreeCAD-0.11.4422/src/Main'
make[2]: *** [all-recursive] Error 1
make[2]: se sale del directorio `/home/dani/AUR/freecad/src/FreeCAD-0.11.4422/src'
make[1]: *** [all-recursive] Error 1
make[1]: se sale del directorio `/home/dani/AUR/freecad/src/FreeCAD-0.11.4422'
make: *** [all] Error 2
==> ERROR: Se produjo un error en build().
    Cancelando...
TagsNo tags attached.

Activities

wmayer

2011-04-29 20:05

administrator   ~0000807

Fixed in r4465

Issue History

Date Modified Username Field Change
2011-04-27 08:25 unauthenticated New Issue
2011-04-29 20:05 wmayer Note Added: 0000807
2011-04-29 20:05 wmayer Status new => closed
2011-04-29 20:05 wmayer Resolution open => fixed
2011-04-29 20:05 wmayer Fixed in Version => 0.12